{"text_format":"1","workbook":"xlsx","n_sheets":4,"sheets":["Tabelle1","SSI","Translations","List"],"not_rendered":{"charts":0,"images":2,"macros":1,"external_links":1,"defined_names":15,"comments":0,"pivot_tables":0},"unopened":[],"bounds":{"document_bytes":16777216,"sheet_cells":100000,"rows_first":2000,"rows_last":500,"rows_between":2000,"halvings":0,"cell_chars":16384,"cell_head_chars":4096},"cells_cut":0,"cells_raw":0,"read":"whole","date_system":"1900"}

{"sheet":"Tabelle1","index":0,"n_rows":17,"n_cols":5,"rows_kept":17,"cut":false,"hidden":false,"merged":[[5,1,10,1],[5,4,10,4]]}
[]
[]
[]
["Important notes: ","The macros have to be active! In addition, if you create a new sheet, the first two rows of the new sheet need to be disabled.",null,"Wichtige Hinweise:","Die Makros müssen aktiviert sein! Zusätzlich müssen beim Erstellen eines neuen Arbeitsblattes die ersten beiden Zeilen gesperrt werden."]
[]
["Description:","To generate the header and footer you have to fill in all the information according the GATE info into the fields below (DocID, Published and optional Old_DocID). Then click on the Generate button. Whenever you create a new work sheet, you have to click on the button to generate the header & footer automatically. The document number will then be adopted into the footer. ",null,"Beschreibung:","Um die Kopf- und Fusszeilen automatisch zu generieren, müssen alle unterstehenden Felder entsprechend der Angaben im GATE ausgefüllt sein (DocID, Published und optional Old_DocID). Der Button \"Generate Header&Footer\" ist der Auslöser. Sobald ein neues Arbeitsblatt hinzugefügt wird, muss dieser Vorgang wiederholt werden. Die Dokumentennummern wird dabei in die Fußzeile übernommen."]
[]
[]
[]
[]
[]
[]
["Title:","Template Excel Title abc"]
["DocID:","SD_24739"]
["Old_DocID:","SD_20167"]
["Published:","2024-10-14"]
["Version:",3]

{"sheet":"SSI","index":1,"n_rows":204,"n_cols":8,"rows_kept":204,"cut":false,"hidden":false,"merged":[[126,5,126,6],[202,2,202,3],[202,5,202,6],[190,2,191,3],[190,5,191,6],[172,2,172,3],[178,2,180,6],[169,5,169,6],[5,2,5,6],[8,3,8,5],[9,3,9,5],[10,3,10,5],[11,3,11,5],[12,3,12,5],[57,3,57,4],[45,2,45,3],[45,4,45,5],[46,2,46,3],[46,4,46,5],[50,5,50,6],[22,3,22,5],[23,3,23,5],[31,3,31,6],[19,3,19,5],[20,2,20,5],[21,3,21,5],[13,3,13,5],[14,3,14,5],[15,3,15,5],[16,3,16,5],[17,3,17,5],[18,3,18,5],[74,3,74,4],[75,3,75,4],[76,3,76,4],[77,3,77,4],[83,3,83,5],[81,2,81,6],[43,2,43,4],[64,3,64,4],[65,3,65,4],[69,3,69,4],[70,3,70,4],[71,3,71,4],[73,3,73,4],[58,3,58,4],[59,3,59,4],[60,3,60,4],[61,3,61,4],[62,3,62,4],[63,3,63,4],[52,3,52,4],[52,5,52,6],[54,3,54,4],[55,3,55,4],[56,3,56,4],[92,2,92,5],[93,2,93,5],[94,2,94,5],[95,2,95,5],[96,2,96,5],[97,2,97,5],[86,2,86,5],[87,2,87,5],[88,2,88,5],[89,2,89,5],[90,2,90,5],[91,2,91,5],[104,2,104,5],[105,2,105,5],[106,2,106,5],[107,2,107,5],[108,2,108,5],[109,2,109,5],[98,2,98,5],[99,2,99,5],[100,2,100,5],[101,2,101,5],[102,2,102,5],[103,2,103,5],[120,5,120,6],[121,5,121,6],[122,5,122,6],[123,5,123,6],[124,5,124,6],[125,5,125,6],[110,2,110,5],[111,2,111,5],[112,2,112,5],[113,2,113,5],[114,2,114,5],[116,2,116,6],[119,5,119,6],[141,3,141,4],[142,3,142,4],[143,3,143,4],[144,3,144,4],[145,3,145,4],[146,3,146,4],[127,5,127,6],[129,3,129,6],[131,2,133,6],[137,3,137,6],[140,3,140,4],[127,2,128,4],[167,3,167,4],[172,5,172,6],[164,3,164,5],[165,3,165,5],[147,3,147,4],[148,3,148,4],[149,3,149,4],[150,3,150,4],[151,3,151,4],[154,3,154,6],[197,2,197,3],[197,5,197,6],[200,2,200,3],[200,5,200,6],[175,2,175,6],[184,2,184,3],[184,5,184,6],[187,2,187,3],[187,5,187,6],[176,2,176,6]]}
[]
[null,null,null,null,"Note: Kindly fill the form in English only"]
[]
[null,null,null,"Language Selection:"]
[]
[null,0,{"$f":"IF(Translations!A2=1,VLOOKUP(SSI!B6,Translations!B:I,2,0),IF(Translations!A2=2,VLOOKUP(SSI!B6,Translations!B:I,3,0),IF(Translations!A2=3,VLOOKUP(SSI!B6,Translations!B:I,4,0),IF(Translations!A2=4,VLOOKUP(SSI!B6,Translations!B:I,5,0),IF(Translations!A2=5,VLOOKUP(SSI!B6,Translations!B:I,6,0), IF(Translations!A2=6, VLOOKUP(SSI!B6,Translations!B:I,7,0), VLOOKUP(SSI!B6,Translations!B:I,8,0)))))))","v":"Oerlikon Supplier Self Information "}]
[]
[null,1,{"$f":"IF(Translations!A2=1, VLOOKUP(SSI!B8,Translations!B:C,2,0), IF(Translations!A2=2, VLOOKUP(SSI!B8,Translations!B:D,3,0), IF(Translations!A2=3, VLOOKUP(SSI!B8,Translations!B:E,4,0), IF(Translations!A2=4, VLOOKUP(SSI!B8,Translations!B:F,5,0), IF(Translations!A2=5, VLOOKUP(SSI!B8,Translations!B:I,6,0),IF(Translations!A2=6, VLOOKUP(SSI!B8,Translations!B:I,7,0), VLOOKUP(SSI!B8,Translations!B:I,8,0)))))))","v":"1.    Company Information"}]
[null,1.01,{"$f":"IF(Translations!A2=1,VLOOKUP(SSI!B9,Translations!B:C,2,0),IF(Translations!A2=2,VLOOKUP(SSI!B9,Translations!B:D,3,0),IF(Translations!A2=3,VLOOKUP(SSI!B9,Translations!B:E,4,0),IF(Translations!A2=4,VLOOKUP(SSI!B9,Translations!B:F,5,0),IF(Translations!A2=5,VLOOKUP(SSI!B9,Translations!B:I,6,0), IF(Translations!A2=6,VLOOKUP(SSI!B9,Translations!B:I,7,0), VLOOKUP(SSI!B9,Translations!B:I,8,0)))))))","v":"Company Name"}]
[null,1.02,{"$f":"IF(Translations!A2=1,VLOOKUP(SSI!B10,Translations!B:C,2,0),IF(Translations!A2=2,VLOOKUP(SSI!B10,Translations!B:D,3,0),IF(Translations!A2=3,VLOOKUP(SSI!B10,Translations!B:E,4,0),IF(Translations!A2=4,VLOOKUP(SSI!B10,Translations!B:F,5,0),IF(Translations!A2=5,VLOOKUP(SSI!B10,Translations!B:I,6,0), IF(Translations!A2=6,VLOOKUP(SSI!B10,Translations!B:I,7,0),VLOOKUP(SSI!B10,Translations!B:I,8,0)))))))","v":"Address"}]
[null,1.03,{"$f":"IF(Translations!A2=1,VLOOKUP(SSI!B11,Translations!B:C,2,0),IF(Translations!A2=2,VLOOKUP(SSI!B11,Translations!B:D,3,0),IF(Translations!A2=3,VLOOKUP(SSI!B11,Translations!B:E,4,0),IF(Translations!A2=4,VLOOKUP(SSI!B11,Translations!B:F,5,0),IF(Translations!A2=5,VLOOKUP(SSI!B11,Translations!B:I,6,0),IF(Translations!A2=6,VLOOKUP(SSI!B11,Translations!B:I,7,0),VLOOKUP(SSI!B11,Translations!B:I,8,0)))))))","v":"Address Supplement"},"                                     "]
[null,1.04,{"$f":"IF(Translations!A2=1, VLOOKUP(SSI!B12,Translations!B:C,2,0), IF(Translations!A2=2, VLOOKUP(SSI!B12,Translations!B:D,3,0), IF(Translations!A2=3, VLOOKUP(SSI!B12,Translations!B:E,4,0), IF(Translations!A2=4, VLOOKUP(SSI!B12,Translations!B:F,5,0),  IF(Translations!A2=5, VLOOKUP(SSI!B12,Translations!B:I,6,0), IF(Translations!A2=6, VLOOKUP(SSI!B12,Translations!B:I,7,0),VLOOKUP(SSI!B12,Translations!B:I,8,0)))))))","v":"Postal Code / City"},"                                       "]
[null,1.05,{"$f":"IF(Translations!A2=1,VLOOKUP(SSI!B13,Translations!B:C,2,0),IF(Translations!A2=2,VLOOKUP(SSI!B13,Translations!B:D,3,0),IF(Translations!A2=3,VLOOKUP(SSI!B13,Translations!B:E,4,0),IF(Translations!A2=4,VLOOKUP(SSI!B13,Translations!B:F,5,0),IF(Translations!A2=5,VLOOKUP(SSI!B13,Translations!B:I,6,0),IF(Translations!A2=6,VLOOKUP(SSI!B13,Translations!B:I,7,0),VLOOKUP(SSI!B13,Translations!B:I,8,0)))))))","v":"Country"}]
[null,1.06,{"$f":"IF(Translations!A2=1, VLOOKUP(SSI!B14,Translations!B:C,2,0), IF(Translations!A2=2, VLOOKUP(SSI!B14,Translations!B:D,3,0), IF(Translations!A2=3, VLOOKUP(SSI!B14,Translations!B:E,4,0), IF(Translations!A2=4, VLOOKUP(SSI!B14,Translations!B:F,5,0), IF(Translations!A2=5, VLOOKUP(SSI!B14,Translations!B:I,6,0),IF(Translations!A2=6, VLOOKUP(SSI!B14,Translations!B:I,7,0), VLOOKUP(SSI!B14,Translations!B:I,8,0)))))))","v":"Region / State"},"                                                             "]
[null,1.07,{"$f":"IF(Translations!A2=1, VLOOKUP(SSI!B15,Translations!B:C,2,0), IF(Translations!A2=2, VLOOKUP(SSI!B15,Translations!B:D,3,0), IF(Translations!A2=3, VLOOKUP(SSI!B15,Translations!B:E,4,0), IF(Translations!A2=4, VLOOKUP(SSI!B15,Translations!B:F,5,0), IF(Translations!A2=5, VLOOKUP(SSI!B15,Translations!B:I,6,0),IF(Translations!A2=6, VLOOKUP(SSI!B15,Translations!B:I,7,0), VLOOKUP(SSI!B15,Translations!B:I,8,0)))))))","v":"Phone Number"}]
[null,1.08,{"$f":"IF(Translations!A2=1, VLOOKUP(SSI!B16,Translations!B:C,2,0), IF(Translations!A2=2, VLOOKUP(SSI!B16,Translations!B:D,3,0), IF(Translations!A2=3, VLOOKUP(SSI!B16,Translations!B:E,4,0), IF(Translations!A2=4, VLOOKUP(SSI!B16,Translations!B:F,5,0),  IF(Translations!A2=5, VLOOKUP(SSI!B16,Translations!B:I,6,0),IF(Translations!A2=6, VLOOKUP(SSI!B16,Translations!B:I,7,0), VLOOKUP(SSI!B16,Translations!B:I,8,0)))))))","v":"Homepage"}]
[null,1.0900000000000001,{"$f":"IF(Translations!A2=1,VLOOKUP(SSI!B17,Translations!B:C,2,0),IF(Translations!A2=2,VLOOKUP(SSI!B17,Translations!B:D,3,0),IF(Translations!A2=3,VLOOKUP(SSI!B17,Translations!B:E,4,0),IF(Translations!A2=4,VLOOKUP(SSI!B17,Translations!B:F,5,0), IF(Translations!A2=5, VLOOKUP(SSI!B17,Translations!B:I,6,0),IF(Translations!A2=6, VLOOKUP(SSI!B17,Translations!B:I,7,0), VLOOKUP(SSI!B17,Translations!B:I,8,0)))))))","v":"Email for electronic P.O."}]
[null,1.1000000000000001,{"$f":"IF(Translations!A2=1, VLOOKUP(SSI!B18,Translations!B:C,2,0), IF(Translations!A2=2, VLOOKUP(SSI!B18,Translations!B:D,3,0), IF(Translations!A2=3, VLOOKUP(SSI!B18,Translations!B:G,4,0), IF(Translations!A2=4, VLOOKUP(SSI!B18,Translations!B:G,5,0),  IF(Translations!A2=5, VLOOKUP(SSI!B18,Translations!B:I,6,0),IF(Translations!A2=6, VLOOKUP(SSI!B18,Translations!B:I,7,0), VLOOKUP(SSI!B18,Translations!B:I,8,0)))))))","v":"Year of foundation"}]
[null,1.1100000000000001,{"$f":"IF(Translations!A2=1, VLOOKUP(SSI!B19,Translations!B:C,2,0), IF(Translations!A2=2, VLOOKUP(SSI!B19,Translations!B:D,3,0), IF(Translations!A2=3, VLOOKUP(SSI!B19,Translations!B:G,4,0), IF(Translations!A2=4, VLOOKUP(SSI!B19,Translations!B:G,5,0),  IF(Translations!A2=5, VLOOKUP(SSI!B19,Translations!B:I,6,0),IF(Translations!A2=6, VLOOKUP(SSI!B19,Translations!B:I,7,0), VLOOKUP(SSI!B19,Translations!B:I,8,0)))))))","v":"Oerlikon Vendor Code (if existing)"}]
[null,1.1200000000000001,{"$f":"IF(Translations!A2=1, VLOOKUP(SSI!B20,Translations!B:G,2,0), IF(Translations!A2=2, VLOOKUP(SSI!B20,Translations!B:G,3,0), IF(Translations!A2=3, VLOOKUP(SSI!B20,Translations!B:G,4,0), IF(Translations!A2=4, VLOOKUP(SSI!B20,Translations!B:G,5,0),  IF(Translations!A2=5, VLOOKUP(SSI!B20,Translations!B:I,6,0),IF(Translations!A2=6, VLOOKUP(SSI!B20,Translations!B:I,7,0), VLOOKUP(SSI!B20,Translations!B:I,8,0)))))))","v":"Dun & Bradstreet ID"}]
[null,1.1299999999999999,{"$f":"IF(Translations!A2=1, VLOOKUP(SSI!B21,Translations!B:C,2,0), IF(Translations!A2=2, VLOOKUP(SSI!B21,Translations!B:G,3,0), IF(Translations!A2=3, VLOOKUP(SSI!B21,Translations!B:G,4,0), IF(Translations!A2=4, VLOOKUP(SSI!B21,Translations!B1:G154,5,0),  IF(Translations!A2=5, VLOOKUP(SSI!B21,Translations!B:I,6,0),IF(Translations!A2=6, VLOOKUP(SSI!B21,Translations!B:I,7,0), VLOOKUP(SSI!B21,Translations!B:I,8,0)))))))","v":"(In order to business with Oerlikon register in Dun & Bradstreet for free)"}]
[null,1.1399999999999999,{"$f":"IF(Translations!A2=1,VLOOKUP(SSI!B22,Translations!B:G,2,0),IF(Translations!A2=2,VLOOKUP(SSI!B22,Translations!B:G,3,0),IF(Translations!A2=3,VLOOKUP(SSI!B22,Translations!B:G,4,0),IF(Translations!A2=4,VLOOKUP(SSI!B22,Translations!B:G,5,0), IF(Translations!A2=5, VLOOKUP(SSI!B22,Translations!B:I,6,0),IF(Translations!A2=6, VLOOKUP(SSI!B22,Translations!B:I,7,0), VLOOKUP(SSI!B22,Translations!B:I,8,0)))))))","v":"VAT Registration Number"}]
[null,1.1499999999999999,{"$f":"IF(Translations!A2=1,VLOOKUP(SSI!B23,Translations!B:G,2,0),IF(Translations!A2=2,VLOOKUP(SSI!B23,Translations!B:G,3,0),IF(Translations!A2=3,VLOOKUP(SSI!B23,Translations!B:G,4,0),IF(Translations!A2=4,VLOOKUP(SSI!B23,Translations!B:G,5,0), IF(Translations!A2=5, VLOOKUP(SSI!B23,Translations!B:I,6,0),IF(Translations!A2=6, VLOOKUP(SSI!B23,Translations!B:I,7,0), VLOOKUP(SSI!B23,Translations!B:I,8,0)))))))","v":"Leading Category Level 1"}]
[null,1.1599999999999999,{"$f":"IF(Translations!A2=1,VLOOKUP(SSI!B24,Translations!B:G,2,0),IF(Translations!A2=2,VLOOKUP(SSI!B24,Translations!B:G,3,0),IF(Translations!A2=3,VLOOKUP(SSI!B24,Translations!B:G,4,0),IF(Translations!A2=4,VLOOKUP(SSI!B24,Translations!B:G,5,0), IF(Translations!A2=5, VLOOKUP(SSI!B24,Translations!B:I,6,0),IF(Translations!A2=6, VLOOKUP(SSI!B24,Translations!B:I,7,0), VLOOKUP(SSI!B24,Translations!B:I,8,0)))))))","v":"Leading Category Level 2"}]
[]
[null,2,{"$f":"IF(Translations!A2=1,VLOOKUP(SSI!B26,Translations!B:G,2,0),IF(Translations!A2=2,VLOOKUP(SSI!B26,Translations!B:G,3,0),IF(Translations!A2=3,VLOOKUP(SSI!B26,Translations!B:G,4,0),IF(Translations!A2=4,VLOOKUP(SSI!B26,Translations!B:G,5,0), IF(Translations!A2=5, VLOOKUP(SSI!B26,Translations!B:I,6,0),IF(Translations!A2=6, VLOOKUP(SSI!B26,Translations!B:I,7,0), VLOOKUP(SSI!B26,Translations!B:I,8,0)))))))","v":"2.     Financial Information"}]
[]
[null,2.1,{"$f":"IF(Translations!A2=1,VLOOKUP(SSI!B28,Translations!B:G,2,0),IF(Translations!A2=2,VLOOKUP(SSI!B28,Translations!B:G,3,0),IF(Translations!A2=3,VLOOKUP(SSI!B28,Translations!B:G,4,0),IF(Translations!A2=4,VLOOKUP(SSI!B28,Translations!B:G,5,0), IF(Translations!A2=5, VLOOKUP(SSI!B28,Translations!B:I,6,0),IF(Translations!A2=6, VLOOKUP(SSI!B28,Translations!B:I,7,0), VLOOKUP(SSI!B28,Translations!B:I,8,0)))))))","v":"2.1   Banking Information"}]
[null,2.11,{"$f":"IF(Translations!A2=1,VLOOKUP(SSI!B29,Translations!B:G,2,0),IF(Translations!A2=2,VLOOKUP(SSI!B29,Translations!B:G,3,0),IF(Translations!A2=3,VLOOKUP(SSI!B29,Translations!B:G,4,0),IF(Translations!A2=4,VLOOKUP(SSI!B29,Translations!B:G,5,0), IF(Translations!A2=5, VLOOKUP(SSI!B29,Translations!B:I,6,0),IF(Translations!A2=6, VLOOKUP(SSI!B29,Translations!B:I,7,0), VLOOKUP(SSI!B29,Translations!B:I,8,0)))))))","v":"IBAN"}]
[null,2.12,{"$f":"IF(Translations!A2=1,VLOOKUP(SSI!B30,Translations!B:G,2,0),IF(Translations!A2=2,VLOOKUP(SSI!B30,Translations!B:G,3,0),IF(Translations!A2=3,VLOOKUP(SSI!B30,Translations!B:G,4,0),IF(Translations!A2=4,VLOOKUP(SSI!B30,Translations!B:G,5,0), IF(Translations!A2=5, VLOOKUP(SSI!B30,Translations!B:I,6,0),IF(Translations!A2=6, VLOOKUP(SSI!B30,Translations!B:I,7,0), VLOOKUP(SSI!B30,Translations!B:I,8,0)))))))","v":"or"}]
{"$rows_left_out":175}
{"sheet":"Translations","index":2,"n_rows":155,"n_cols":9,"rows_kept":155,"cut":false,"hidden":true,"merged":[]}
[null,"Ref","English","German","Chinese","French","Hindi","Portuguese","Italian"]
[1,0,"Oerlikon Supplier Self Information ","Informationen über Zulieferer von Oerlikon","Oerlikon 供应商个人信息  ","Informations sur les fournisseurs d'Oerlikon  ","Oerlikon आपूर्तिकर्ता स्वयं जानकारी  ","Auto-informação do Fornecedor Oerlikon ","Informazioni fornitore Oerlikon"]
[null,1,"1.    Company Information","1.     Angaben zum Unternehmen","1.    公司信息","1.    Informations de l'entreprise","1.    कंपनी की जानकारी","1.     Informação da companhia","1.     Dati dell'azienda"]
["English",1.01,"Company Name","Name des Unternehmens :","公司名称","Nom de l'entreprise","कंपनी का नाम","Nome da companhia:","Nome dell'azienda:"]
["German",1.02,"Address","Adresse","地址","Adresse","पता","Endereço:","Indirizzo:"]
["Chinese",1.03,"Address Supplement","Zusätzliche Adressangaben :","地址附录","Supplément d'adresse","पता संलग्न","Suplemento de endereço:","Dati aggiuntivi indirizzo:"]
["French",1.04,"Postal Code / City","Postleitzahl / Stadt","邮政编码/城市","Code postal / Ville","पोस्टल कोड / शहर","Código postal / Cidade:","Codice postale / Città:"]
["Hindi",1.05,"Country","Land","國家","Pays","देश","País:","Paese:"]
["Portuguese",1.06,"Region / State","Region / Bundesland","地区/州","Région / État","क्षेत्र / राज्य","Região / Estado:","Regione / Stato:"]
["Italian",1.07,"Phone Number","Telefonnummer","电话号码","Numéro de téléphone","फ़ोन नंबर","Número de telefone:","Numero di telefono:"]
[null,1.08,"Homepage","Website","首页","Page d'accueil","मुखपृष्ठ","Página inicial:","Homepage:"]
[null,1.0900000000000001,"Email for electronic P.O.","E-Mail für elektronische Bestellung","电子采购订单的邮件。","Email pour bon de commande électronique","इलेक्ट्रॉनिक पीओ के लिए ईमेल।","Correio eletrónico:","Email per ordine d'acquisto elettronico"]
[null,1.1000000000000001,"Year of foundation","Gründungsjahr","建立年份","Année de fondation","स्थापना का वर्ष","Ano de fundação:","Anno di fondazione:"]
[null,1.1100000000000001,"Oerlikon Vendor Code (if existing)","Oerlikon Zulieferer code (sofern vorhanden) :","奥尔利康供应商代码（如有）","Code du fournisseur Oerlikon (si disponible) :","Oerlikon विक्रेता कोड (यदि मौजूद है)","Código do fornecedor Oerlikon (se existente):","Codice fornitore Oerlikon (se disponibile):"]
[null,1.1200000000000001,"Dun & Bradstreet ID","Dun & Bradstreet Nummer","邓白氏身份证","Identifiant Dun & Bradstreet","D-U-N-S व्याख्या","Número D-U-N-S","Numero D-U-N-S "]
[null,1.1299999999999999,"(In order to business with Oerlikon register in Dun & Bradstreet for free)","(Um mit Oerlikon Geschäfte zu machen, registrieren Sie sich kostenlos in Dun & Bradstreet)","(为了与欧瑞康开展业务，免费在Dun＆Bradstreet注册)","(Pour faire affaire avec Oerlikon, inscrivez-vous gratuitement à Dun & Bradstreet)","(डन एंड ब्रैडस्ट्रीट में ओर्लिकॉन रजिस्टर के साथ मुफ्त में व्यापार करने के लिए)","(Para fazer negócios com a Oerlikon, registre-se gratuitamente na Dun & Bradstreet)","(Per fare affari con Oerlikon, registrati gratuitamente a Dun & Bradstreet)"]
[null,1.1399999999999999,"VAT Registration Number","Umsatzsteuer-Identifikationsnummer","注册增值税号码","Numéro d’identification :","मूल्य वर्धित कर पंजीयन क्रमांक :","Número de identificação fiscal:","Codice IVA:"]
[null,1.1499999999999999,"Leading Category Level 1","Führende Kategorie Ebene 1","领导类别一级","Catégorie principale de niveau 1","अग्रणी श्रेणी स्तर 1","Nível da categoria principal 1:","Livello di categoria principale 1:"]
[null,1.1599999999999999,"Leading Category Level 2","Führende Kategorie Ebene 2","领导类别二级","Catégorie principale de niveau 2","अग्रणी श्रेणी स्तर 2","Nível da categoria principal 2:","Livello di categoria principale 2:"]
[null,2,"2.     Financial Information","2.     Finanzdaten","2.     财务信息","2.     Données financières","2.     वित्तीय जानकारी","2.     Informação financeira","2.     Dati finanziari"]
[null,2.1,"2.1   Banking Information","2.1     Bankdaten","2.1   银行信息","2.1     Données bancaires","2.1   बैंकिंग जानकारी","2.1     Informação bancária","2.1     Dati bancari"]
[null,2.11,"IBAN","IBAN",{"$f":"C22","v":"IBAN"},"IBAN","IBAN","IBAN","IBAN"]
[null,2.12,"or","oder","或","ou","अथवा","ou","o"]
[null,2.13,"Bank Name:","Bankname:","银行名称：","Nom de banque :","बैंक का नाम:","Nome do banco:","Nome della banca:"]
[null,2.14,"Bank Address:","Bankadresse:","银行地址：","Adresse de la banque :","बैंक का पता:","Endereço do banco:","Indirizzo bancario:"]
[null,2.15,"Bank Number:","Banknummer:","银行号码。","Numéro de banque :","बैंक नंबर:","Número do banco:","Numero di banca:"]
[null,2.16,"Account Number:","Kontonummer:","账号：","Numéro de compte :","खाता संख्या:","Número da conta:","Numero di conto:"]
[null,2.17,"SWIFT / BIC-Code:","SWIFT / BIC-Code:","SWIFT / BIC-Code:","SWIFT / BIC-Code:","SWIFT / BIC कोड :","Código SWIFT/BIC:","Codice SWIFT / BIC:"]
[null,2.2000000000000002,"2.2   Insurance Information","2.2     Versicherungsdaten","2.2   保险信息","2.2     Données d'assurance","2.2   बीमा जानकारी","2.2   Informação sobre seguros","2.2     Dati assicurativi"]
[null,2.21,"Business liability insurance","Geschäftshaftpflichtversicherung","企业责任保险","Assurance responsabilité civile","व्यापार देयता बीमा","Seguro de responsabilidade comercial","Assicurazione di Responsabilità civile commerciale"]
{"$rows_left_out":126}
{"sheet":"List","index":3,"n_rows":32,"n_cols":17,"rows_kept":32,"cut":false,"hidden":true,"merged":[]}
["Raw_Material","Electrical_Equipment","Standard_Parts_Catalog_Parts","General_Sub_Assemblies_Systems_Components","Mechanical_Components","Mechanical_Drive_Technology","Pneumatics_Hydraulics","Materials_Consumables_Supplies","Non_Production_Material","External_Processing","Thermal_Spray_Products","Metal_Waste_Scrap_and_by_Products",null,null,{"$f":"SSI!D23:F23","v":0},0,0]
["Raw Material-1000","Thermal Spray Powders-2001","Standard Parts / Catalog Parts-3000","General Sub-Assemblies, Systems, Compone-4000","Mechanical Components-5000","Mechanical Drive Technology-6000","Aerospace-7001","Materials, consumables, and supplies-8000","Non-Production Material-8500","External Processing-9000","Thermal Spray products-9700","Scrap  Material for Recycling-9800",null,null,"Filtered List"]
["Engineered System-1001","HVOF Powders-2002","Services-3001","Model, raw material supply-4041","Cast parts-5051","Transmission (without motor)-6061","Industrial Gas Turbine-7002","Machining Accessories-8081","Working materials-8501","Packing materials-9001","Abradables-9701","Tungsten based scrap-9810",null,null,{"$f":"_xlfn._xlws.SORT(_xlfn.UNIQUE( _xlfn.XLOOKUP(List!O1,LIST,List!A2:L40),,TRUE))","v":{"$error":"#N/A"}}]
["Stand Alone System-1002","Thermal Spray Wires-2003","Springs-3010","Thread manufacture / finishing-4042","Plastic-5052","Gearing-6062","Automotive-7003","Heat Treat Supplies-8082","Overhead costs material-8503","Services-9002","Carbides-9702","Aluminium based scrap-9820"]
["Core Component-1003","Braze Materials-2004","Washer, ring-3020","Packages / laps-4043","Ceramic-5053","Belt pulleys-6063","Medical-7004","Misc. Equipment Parts-8083","Office equipment-8504","Others-9003","Metal & Alloys-9703"]
["Key Component-1004","Pack Diffusion Alloys-2005","Bolt, cotter pin, wedge-3030","Supplementary attachments-4044","Sintered parts, permanent magnets, Magne-5054","Belts-6064","Textile-7005","Colors, paints-8084","EDP, telecommunications-8505","Outsourced production-9091","Ceramics-9704"]
["Peripheral Component-1005","Braze Superalloys-2006","Screws, nuts-3031","Trading goods-4045","Machine cutting parts-5055","Couplings-6065","Paper / Print & Steel-7006","General Maintenance-8085","Capital Investments-8506","Surface Treatment-9092","Electronics-9705"]
["Accessory Component-1006","Auxiliary Materials-2007","Pins, nails, hooks, rivets-3032","Other sub-assemblies/systems-4046","Sheet metal parts-5056","Bearings and rollers-6066","Industrial Components-7007","Chemicals-8086","Leasing-8507","Subcontracting-9093","Wires (excl. Carbide based)-9706"]
["Spare Parts-1007","Welding Products-2008","Turnbuckles, shackles-3033","Integrated Modules-4047","Bent parts-5057","Chains, ropes, accessories-6067","Oil / Gas Industry-7008","Technical gases-8087","Shipment / Transportation Costs (850840)-8508","Intercompany Transfer Parts-9094","Braze-9707"]
["Other-1008","Infiltration Matrix Materials-2009","Straps-3034","Sub-Assemblies-4048","Steel structure, chassis, frames,-5058","Brakes-6068","Pneumatics / Hydraulics-7070","Coating Material-8088","Energy-8509","Customer Furnished Parts-9095","Nickel Powders-9708"]
["Wear Part-1009","Electronic Powders-2010","Operating elements (also as per drawing)-3035","Spare parts-4049","Mechanical sub-assemblies-5059","Torque Converter-6069","Pneumatics-7071","Adhesives-8089","Travel-8510","Customer Imposed Parts-9096","Other Auxilliaries-9709"]
["Raw Material-1010","Powder Metallurgy Products-2011","Seals, insulators-3036","Plant Design-4050","Glass-5060","Flange and misc. Transmission components-6070","Hydraulics-7072","Oils, greases, lubricants-8090","Marketing-8520"]
["Cold drawn steel-1011","Electrical Equipment-2020","Pipe accessories, fittings-3040","Tyre Machine-4051","Combs-5061","Sleeve Hub and Wheel-6071","Vacuum components-7073","Welding Supplies-8091","Services-8530"]
["Sheet metal-1012","Motors, converters, fans-2021","Signs, labels, inscriptions-3050","Welding Machineries-4052",null,"Threaded spindle, cardan, angle joints-6072","Vacuum Pumps-7074","Packaging Material-8092","Sales-related service-8580"]
["Bars, profiles-1013","Transformers, chokes, magnets-2022","Hard paper, fabric base laminate, leathe-3060",null,null,"Differentials-6073","Vacuum Valves-7075","Tools, assemblies, models, measuring aid-8093"]
["Heat treated alloy-1014","Electrical switching devices-2023","Wire fabric-3070",null,null,null,"Vacuum Instrumentation-7076"]
["Aluminium-1015","Cables, lines, and cord sets-2024",null,null,null,null,"Vacuum Accessories-7077"]
["Copper, Brass-1016","Electrical installation devices, materia-2025",null,null,null,null,"Vacuum Components-7078"]
["Titanium-1017","Sensor technology, measuring technology-2026",null,null,null,null,"Vacuum Fittings-7079"]
["Tubes-1018","Electronic devices-2027"]
["Forged raw-1019","PC equipment, automation, control-2028"]
["Plastic semi-finished products-1020","Power supply units and power supply-2029"]
["Cold rolled sections, steel strips galva-1021","Electrical sub-assemblies-2030"]
["Wood-1022"]
["Prepreg-1023"]
["Raw Material OTC-1024"]
["Polymers-1025"]
["Fillers-1026"]
["Plasticizers-1027"]
["Vulcanization agents-1028"]
{"$rows_left_out":2}